Target
Disintegrin and metalloproteinase domain-containing protein 10
Ligand
BDBM50292682
Substrate
Meas. Tech.
ChEMBL_496902 (CHEMBL1001997)
Ki
>10000000±n/a nM
Citation
 Mazzola, RDZhu, ZSinning, LMcKittrick, BLavey, BSpitler, JKozlowski, JNeng-Yang, SZhou, GGuo, ZOrth, PMadison, VSun, JLundell, DNiu, X Discovery of novel hydroxamates as highly potent tumor necrosis factor-alpha converting enzyme inhibitors. Part II: optimization of the S3' pocket. Bioorg Med Chem Lett 18:5809-14 (2009)  
Target
Name:
Disintegrin and metalloproteinase domain-containing protein 10
Synonyms:
ADA10_HUMAN Disintegrin and metalloproteinase domain-containing protein 10 (ADAM10) MADM
Type:
Enzyme
Mol. Mass.:
84160.93
Organism:
Homo sapiens (Human)
Description:
O14672
Residue:
748
  
Inhibitor
Name:
BDBM50292682
Synonyms:
(1R,2S)-1-(3-fluoro-4-((2-phenylquinolin-4-yl)methoxy)benzyl)-N2-hydroxy-N1,N1-dimethylcyclopropane-1,2-dicarboxamide | CHEMBL496309
Type:
Small organic molecule
Emp. Form.:
C30H28FN3O4
Mol. Mass.:
513.5594
SMILES:
CN(C)C(=O)[C@@]1(Cc2ccc(OCc3cc(nc4ccccc34)-c3ccccc3)c(F)c2)C[C@@H]1C(=O)NO
: