Target
Disintegrin and metalloproteinase domain-containing protein 17
Ligand
BDBM50292690
Substrate
Meas. Tech.
ChEMBL_496896 (CHEMBL1001173)
Ki
0.210000±n/a nM
Citation
 Mazzola, RDZhu, ZSinning, LMcKittrick, BLavey, BSpitler, JKozlowski, JNeng-Yang, SZhou, GGuo, ZOrth, PMadison, VSun, JLundell, DNiu, X Discovery of novel hydroxamates as highly potent tumor necrosis factor-alpha converting enzyme inhibitors. Part II: optimization of the S3' pocket. Bioorg Med Chem Lett 18:5809-14 (2009)  
Target
Name:
Disintegrin and metalloproteinase domain-containing protein 17
Synonyms:
ADA17_HUMAN CSVP Disintegrin and metalloproteinase domain-containing protein 17 (ADAM17) TNF-alpha convertase TNF-alpha-converting enzyme (TACE) Tumor necrosis factor-α converting enzyme (TACE)
Type:
Enzyme
Mol. Mass.:
93007.89
Organism:
Homo sapiens (Human)
Description:
Residue:
824
  
Inhibitor
Name:
BDBM50292690
Synonyms:
(1R,2S)-1-(3-fluoro-4-((2-morpholinoquinolin-4-yl)methoxy)benzyl)-N2-hydroxycyclopropane-1,2-dicarboxamide | CHEMBL467747
Type:
Small organic molecule
Emp. Form.:
C26H27FN4O5
Mol. Mass.:
494.5148
SMILES:
NC(=O)[C@@]1(Cc2ccc(OCc3cc(nc4ccccc34)N3CCOCC3)c(F)c2)C[C@@H]1C(=O)NO
: