Target
Receptor-type tyrosine-protein kinase FLT3
Ligand
BDBM50297455
Substrate
Meas. Tech.
ChEMBL_586029 (CHEMBL1063586)
Ki
4000±n/a nM
Citation
 Cao, JGao, HBemis, GSalituro, FLedeboer, MHarrington, EWilke, STaslimi, PPazhanisamy, SXie, XJacobs, MGreen, J Structure-based design and parallel synthesis of N-benzyl isatin oximes as JNK3 MAP kinase inhibitors. Bioorg Med Chem Lett 19:2891-5 (2009)  
Target
Name:
Receptor-type tyrosine-protein kinase FLT3
Synonyms:
CD135 FL cytokine receptor FLK2 FLT3 Fetal liver kinase-2 Fms-like tyrosine kinase 3 (Flt-3) STK-1 Stem cell tyrosine kinase 1
Type:
Enzyme
Mol. Mass.:
112888.62
Organism:
Homo sapiens (Human)
Description:
P36888
Residue:
993
  
Inhibitor
Name:
BDBM50297455
Synonyms:
1-((6-fluoro-4H-benzo[d][1,3]dioxin-8-yl)methyl)-3-(hydroxyimino)-6-methylindolin-2-one | CHEMBL551140
Type:
Small organic molecule
Emp. Form.:
C18H15FN2O4
Mol. Mass.:
342.3211
SMILES:
Cc1ccc2C(N=O)C(=O)N(Cc3cc(F)cc4COCOc34)c2c1
: