Target
RAC-alpha serine/threonine-protein kinase
Ligand
BDBM50298479
Substrate
Meas. Tech.
ChEMBL_587680 (CHEMBL1049250)
IC50
2.5±n/a nM
Citation
 Dong, XJiang, CHu, HYan, JChen, JHu, Y QSAR study of Akt/protein kinase B (PKB) inhibitors using support vector machine. Eur J Med Chem 44:4090-7 (2009)  
Target
Name:
RAC-alpha serine/threonine-protein kinase
Synonyms:
AKT phosphorylation (p-AKT) AKT1/PPP1CA C-AKT PKB alpha Protein kinase B Protein kinase B (Akt 1) Protein kinase B alpha Proto-oncogene Akt (Akt1) Proto-oncogene c-Akt (AKT1) RAC-PK-alpha RAC-alpha serine/threonine-protein kinase (AKT1) | RAC-alpha serine/threonine-protein kinase (pAKT)
Type:
Enzyme
Mol. Mass.:
55681.25
Organism:
Homo sapiens (Human)
Description:
P31749
Residue:
480
  
Inhibitor
Name:
BDBM50298479
Synonyms:
(S)-1-(4-fluoro-3-methylphenyl)-3-(5-(3-methyl-1H-pyrazolo[3,4-c]pyridin-5-yl)pyridin-3-yloxy)propan-2-amine | CHEMBL573359
Type:
Small organic molecule
Emp. Form.:
C22H22FN5O
Mol. Mass.:
391.4414
SMILES:
Cc1n[nH]c2cnc(cc12)-c1cncc(OC[C@@H](N)Cc2ccc(F)c(C)c2)c1
: