Target
Delta-type opioid receptor
Ligand
BDBM50299217
Substrate
Meas. Tech.
ChEMBL_592545 (CHEMBL1046752)
Ki
1.8±n/a nM
Citation
 Purington, LCPogozheva, IDTraynor, JRMosberg, HI Pentapeptides displaying mu opioid receptor agonist and delta opioid receptor partial agonist/antagonist properties. J Med Chem 52:7724-31 (2009)  
Target
Name:
Delta-type opioid receptor
Synonyms:
Cytochrome P450 3A4 Delta opioid receptor Delta-type opioid receptor (DOR) OPRD_RAT Opioid receptor Opioid receptors; mu & delta Ror-a | Voltage-gated potassium channel
Type:
G Protein-Coupled Receptor (GPCR)
Mol. Mass.:
40465.04
Organism:
Rattus norvegicus (rat)
Description:
Competition binding assays were using CHO-K1 cell membranes expressing the opioid receptor.
Residue:
372
  
Inhibitor
Name:
BDBM50299217
Synonyms:
(5R,8S,11S,14S)-14-((S)-2-amino-3-(4-hydroxyphenyl)propanamido)-8,11-dibenzyl-7,10,13-trioxo-1,3-dithia-6,9,12-triazacyclopentadecane-5-carboxamide | CHEMBL583066
Type:
Small organic molecule
Emp. Form.:
C34H40N6O6S2
Mol. Mass.:
692.848
SMILES:
N[C@@H](Cc1ccc(O)cc1)C(=O)N[C@@H]1CSCSC[C@H](NC(=O)[C@H](Cc2ccccc2)NC(=O)[C@H](Cc2ccccc2)NC1=O)C(N)=O
: