Target
Kappa-type opioid receptor
Ligand
BDBM50059583
Substrate
Meas. Tech.
ChEMBL_590530 (CHEMBL1058577)
Ki
14.8±n/a nM
Citation
 Patkar, KAMurray, TFAldrich, JV The effects of C-terminal modifications on the opioid activity of [N-benzylTyr(1)]dynorphin A-(1-11) analogues. J Med Chem 52:6814-21 (2009)  
Target
Name:
Kappa-type opioid receptor
Synonyms:
KOR-1 OPIATE Kappa Opioid receptor Ror-d
Type:
G Protein-Coupled Receptor (GPCR)
Mol. Mass.:
42692.90
Organism:
Rattus norvegicus (rat)
Description:
P34975
Residue:
380
  
Inhibitor
Name:
BDBM50059583
Synonyms:
CHEMBL268818 PhCH2Tyr-Gly-Gly-Phe-Leu-Arg-Arg-lle-Arg-Pro-LysOH
Type:
Small organic molecule
Emp. Form.:
C70H109N21O13
Mol. Mass.:
1452.7474
SMILES:
CC[C@H](C)[C@H](NC(=O)[C@H](CCCNC(N)=N)NC(=O)[C@H](CCCNC(N)=N)NC(=O)[C@H](CC(C)C)NC(=O)[C@H](Cc1ccccc1)NC(=O)CNC(=O)CNC(=O)[C@H](Cc1ccc(O)cc1)NCc1ccccc1)C(=O)N[C@@H](CCCNC(N)=N)C(=O)N1CCC[C@H]1C(=O)N[C@@H](CCCCN)C(O)=O
: