Target
Alkaline phosphatase, tissue-nonspecific isozyme
Ligand
BDBM50299528
Substrate
Meas. Tech.
ChEMBL_591437 (CHEMBL1054557)
IC50
1130±n/a nM
Citation
 Dahl, RSergienko, EASu, YMostofi, YSYang, LSimao, AMNarisawa, SBrown, BMangravita-Novo, AVicchiarelli, MSmith, LHO'Neill, WCMillán, JLCosford, ND Discovery and validation of a series of aryl sulfonamides as selective inhibitors of tissue-nonspecific alkaline phosphatase (TNAP). J Med Chem 52:6919-25 (2009)  
Target
Name:
Alkaline phosphatase, tissue-nonspecific isozyme
Synonyms:
ALPL tissue-nonspecific alkaline phosphatase precursor
Type:
PROTEIN
Mol. Mass.:
57306.17
Organism:
Homo sapiens (Human)
Description:
ChEMBL_1448917
Residue:
524
  
Inhibitor
Name:
BDBM50299528
Synonyms:
2-ethoxy-5-methyl-N-(pyridin-3-yl)benzenesulfonamide cid_934901
Type:
Small organic molecule
Emp. Form.:
C14H16N2O3S
Mol. Mass.:
292.353
SMILES:
CCOc1ccc(C)cc1S(=O)(=O)Nc1cccnc1
: