Target
Adenosine receptor A3
Ligand
BDBM50205710
Substrate
Meas. Tech.
ChEMBL_588680 (CHEMBL1056090)
Ki
1.9±n/a nM
Citation
 Volpini, RBuccioni, MDal Ben, DLambertucci, CLammi, CMarucci, GRamadori, ATKlotz, KNCristalli, G Synthesis and biological evaluation of 2-alkynyl-N6-methyl-5'-N-methylcarboxamidoadenosine derivatives as potent and highly selective agonists for the human adenosine A3 receptor. J Med Chem 52:7897-900 (2009)  
Target
Name:
Adenosine receptor A3
Synonyms:
A3 adenosine receptor (hA3) ADORA3 | Adenosine A3 receptor (A3AR)
Type:
G Protein-Coupled Receptor (GPCR)
Mol. Mass.:
36197.32
Organism:
Homo sapiens (Human)
Description:
P0DMS8
Residue:
318
  
Inhibitor
Name:
BDBM50205710
Synonyms:
(2S,3S,4R)-3,4-dihydroxy-5-((R)-6-methoxyamino-2-phenylethynyl-9H-purin-3-yl)-tetrahydro-furan-2-carboxylic acid methylamide CHEMBL221206
Type:
Small organic molecule
Emp. Form.:
C20H20N6O5
Mol. Mass.:
424.41
SMILES:
CNC(=O)[C@H]1O[C@H]([C@H](O)[C@@H]1O)n1cnc2c(NOC)nc(nc12)C#Cc1ccccc1
: