Target
5-hydroxytryptamine receptor 1A
Ligand
BDBM50299785
Substrate
Meas. Tech.
ChEMBL_589382 (CHEMBL1047377)
Ki
128±n/a nM
Citation
 Gray, DLXu, WCampbell, BMDounay, ABBarta, NBoroski, SDenny, LEvans, LStratman, NProbert, A Discovery and pharmacological characterization of aryl piperazine and piperidine ethers as dual acting norepinephrine reuptake inhibitors and 5-HT1A partial agonists. Bioorg Med Chem Lett 19:6604-7 (2009)  
Target
Name:
5-hydroxytryptamine receptor 1A
Synonyms:
5-HT-1A 5-hydroxytryptamine receptor 1A (5-HT-1A) ADRB2RL1 Dopamine D2 receptor and serotonin 1a receptor HTR1A | Serotonin receptor 1A
Type:
Mol. Mass.:
46122.49
Organism:
Homo sapiens (Human)
Description:
Residue:
422
  
Inhibitor
Name:
BDBM50299785
Synonyms:
1-(2-phenoxyphenyl)piperazine | CHEMBL573532
Type:
Small organic molecule
Emp. Form.:
C16H18N2O
Mol. Mass.:
254.3269
SMILES:
C1CN(CCN1)c1ccccc1Oc1ccccc1
: