Target
Adenosine receptor A3
Ligand
BDBM50264214
Substrate
Meas. Tech.
ChEMBL_590638 (CHEMBL1052922)
Ki
1.06±n/a nM
Citation
 Tosh, DKChinn, MIvanov, AAKlutz, AMGao, ZGJacobson, KA Functionalized congeners of A3 adenosine receptor-selective nucleosides containing a bicyclo[3.1.0]hexane ring system. J Med Chem 52:7580-92 (2009)  
Target
Name:
Adenosine receptor A3
Synonyms:
A3 adenosine receptor (hA3) ADORA3 | Adenosine A3 receptor (A3AR)
Type:
G Protein-Coupled Receptor (GPCR)
Mol. Mass.:
36197.32
Organism:
Homo sapiens (Human)
Description:
P0DMS8
Residue:
318
  
Inhibitor
Name:
BDBM50264214
Synonyms:
(1'R,2'R,3'S,4'R,5'S)-4'-[2-Chloro-6-(3-chlorobenzylamino)-purine]-2',3'-O-dihydroxybicyclo-[3.1.0]hexane CHEMBL523797
Type:
Small organic molecule
Emp. Form.:
C18H17Cl2N5O2
Mol. Mass.:
406.266
SMILES:
O[C@@H]1[C@@H]2C[C@@H]2[C@H]([C@@H]1O)n1cnc2c(NCc3cccc(Cl)c3)nc(Cl)nc12
: