Target
Histone deacetylase 7
Ligand
BDBM50300447
Substrate
Meas. Tech.
ChEMBL_592001 (CHEMBL1050116)
IC50
260±n/a nM
Citation
 Tessier, PSmil, DVWahhab, ALeit, SRahil, JLi, ZDéziel, RBesterman, JM Diphenylmethylene hydroxamic acids as selective class IIa histone deacetylase inhibitors. Bioorg Med Chem Lett 19:5684-8 (2009)  
Target
Name:
Histone deacetylase 7
Synonyms:
HD7 HDAC7A Histone acetylase 7 (HDAC7) Human HDAC7
Type:
Chromatin regulator; hydrolase; repressor
Mol. Mass.:
102942.62
Organism:
Homo sapiens (Human)
Description:
Q8WUI4
Residue:
952
  
Inhibitor
Name:
BDBM50300447
Synonyms:
CHEMBL575482 | N-hydroxy-9,10-dihydroanthracene-9-carboxamide
Type:
Small organic molecule
Emp. Form.:
C15H13NO2
Mol. Mass.:
239.2692
SMILES:
ONC(=O)C1c2ccccc2Cc2ccccc12
: