Target
Adenosine receptor A3
Ligand
BDBM50300684
Substrate
Meas. Tech.
ChEMBL_589466 (CHEMBL1059252)
Ki
10±n/a nM
Citation
 Lenzi, OColotta, VCatarzi, DVarano, FPoli, DFilacchioni, GVarani, KVincenzi, FBorea, PAPaoletta, SMorizzo, EMoro, S 2-Phenylpyrazolo[4,3-d]pyrimidin-7-one as a new scaffold to obtain potent and selective human A3 adenosine receptor antagonists: new insights into the receptor-antagonist recognition. J Med Chem 52:7640-52 (2009)  
Target
Name:
Adenosine receptor A3
Synonyms:
A3 adenosine receptor (hA3) ADORA3 | Adenosine A3 receptor (A3AR)
Type:
G Protein-Coupled Receptor (GPCR)
Mol. Mass.:
36197.32
Organism:
Homo sapiens (Human)
Description:
P0DMS8
Residue:
318
  
Inhibitor
Name:
BDBM50300684
Synonyms:
5-methyl-2-p-tolyl-2H-pyrazolo[4,3-d]pyrimidin-7(6H)-one | CHEMBL583794
Type:
Small organic molecule
Emp. Form.:
C13H12N4O
Mol. Mass.:
240.2606
SMILES:
Cc1ccc(cc1)-n1cc2nc(C)[nH]c(=O)c2n1
: