Target
Synaptic vesicular amine transporter
Ligand
BDBM50301024
Substrate
Meas. Tech.
ChEMBL_598158 (CHEMBL1044342)
Ki
28.0±n/a nM
Citation
 Zhu, LLiu, JKung, HF Synthesis and evaluation of 2-amino-dihydrotetrabenzine derivatives as probes for imaging vesicular monoamine transporter-2. Bioorg Med Chem Lett 19:5026-8 (2009)  
Target
Name:
Synaptic vesicular amine transporter
Synonyms:
Monoamine transporter Solute carrier family 18 member 2 Synaptic vesicular amine transporter VMAT2_RAT Vesicular monoamine transporter 2 (VMAT2) | Vmat2
Type:
Protein
Mol. Mass.:
55689.58
Organism:
Rattus norvegicus (Rat)
Description:
Q01827
Residue:
515
  
Inhibitor
Name:
BDBM50301024
Synonyms:
CHEMBL571308 | N-(2-fluoroethyl)-3-isobutyl-9,10-dimethoxy-2,3,4,6,7,11b-hexahydro-1H-pyrido[2,1-a]isoquinolin-2-amine
Type:
Small organic molecule
Emp. Form.:
C21H33FN2O2
Mol. Mass.:
364.4973
SMILES:
COc1cc2CCN3CC(CC(C)C)C(CC3c2cc1OC)NCCF
: