Target
Plasminogen
Ligand
BDBM50301975
Substrate
Meas. Tech.
ChEMBL_599101 (CHEMBL1047156)
IC50
5000±n/a nM
Citation
 West, CWAdler, MArnaiz, DChen, DChu, KGualtieri, GHo, EHuwe, CLight, DPhillips, GPulk, RSukovich, DWhitlow, MYuan, SBryant, J Identification of orally bioavailable, non-amidine inhibitors of Urokinase Plasminogen Activator (uPA). Bioorg Med Chem Lett 19:5712-5 (2009)  
Target
Name:
Plasminogen
Synonyms:
Activation peptide PLG Plasmin Plasmin heavy chain A, short form | Plasmin light chain B
Type:
Enzyme
Mol. Mass.:
90579.18
Organism:
Homo sapiens (Human)
Description:
Residue:
810
  
Inhibitor
Name:
BDBM50301975
Synonyms:
2-(6-(5-amino-3'-(aminomethyl)biphenyl-3-yloxy)-3,5-difluoropyridin-2-yloxy)-4-methylbenzoic acid | CHEMBL579027
Type:
Small organic molecule
Emp. Form.:
C26H21F2N3O4
Mol. Mass.:
477.4594
SMILES:
Cc1ccc(C(O)=O)c(Oc2nc(Oc3cc(N)cc(c3)-c3cccc(CN)c3)c(F)cc2F)c1
: