Target
Tissue-type plasminogen activator
Ligand
BDBM50301989
Substrate
Meas. Tech.
ChEMBL_599100 (CHEMBL1047155)
IC50
3900±n/a nM
Citation
 West, CWAdler, MArnaiz, DChen, DChu, KGualtieri, GHo, EHuwe, CLight, DPhillips, GPulk, RSukovich, DWhitlow, MYuan, SBryant, J Identification of orally bioavailable, non-amidine inhibitors of Urokinase Plasminogen Activator (uPA). Bioorg Med Chem Lett 19:5712-5 (2009)  
Target
Name:
Tissue-type plasminogen activator
Synonyms:
Alteplase Reteplase Thrombin receptor protein Tissue-type plasminogen activator (tPA) t-PA t-plasminogen activator
Type:
Enzyme
Mol. Mass.:
62931.08
Organism:
Homo sapiens (Human)
Description:
Residue:
562
  
Inhibitor
Name:
BDBM50301989
Synonyms:
2-(6-(3'-carbamimidoylbiphenyl-3-yloxy)-3,5-difluoro-4-methylpyridin-2-yloxy)-4-(dimethylamino)benzoic acid | CHEMBL571392
Type:
Small organic molecule
Emp. Form.:
C28H24F2N4O4
Mol. Mass.:
518.5114
SMILES:
CN(C)c1ccc(C(O)=O)c(Oc2nc(Oc3cccc(c3)-c3cccc(c3)C(N)=N)c(F)c(C)c2F)c1
: