Target
Urotensin-2 receptor
Ligand
BDBM50249878
Substrate
Meas. Tech.
ChEMBL_596665 (CHEMBL1048827)
IC50
34±n/a nM
Citation
 Lawson, ECLuci, DKGhosh, SKinney, WAReynolds, CHQi, JSmith, CEWang, YMinor, LKHaertlein, BJParry, TJDamiano, BPMaryanoff, BE Nonpeptide urotensin-II receptor antagonists: a new ligand class based on piperazino-phthalimide and piperazino-isoindolinone subunits. J Med Chem 52:7432-45 (2009)  
Target
Name:
Urotensin-2 receptor
Synonyms:
G-protein coupled receptor 14 Gpr14 UR-II-R Urotensin-II | Uts2r
Type:
Enzyme Catalytic Domain
Mol. Mass.:
42725.34
Organism:
RAT
Description:
Urotensin-II UTS2R RAT::P49684
Residue:
386
  
Inhibitor
Name:
BDBM50249878
Synonyms:
(R)-2-bromo-4,5-dimethoxy-N-(3-(1-methylpyrrolidin-3-yloxy)-4-(trifluoromethyl)phenyl)benzenesulfonamide SB-706375
Type:
Small organic molecule
Emp. Form.:
C20H22BrF3N2O5S
Mol. Mass.:
539.363
SMILES:
COc1cc(Br)c(cc1OC)S(=O)(=O)Nc1ccc(c(O[C@@H]2CCN(C)C2)c1)C(F)(F)F
: