Target
Urotensin-2 receptor
Ligand
BDBM50302231
Substrate
Meas. Tech.
ChEMBL_596666 (CHEMBL1048828)
Ki
230±n/a nM
Citation
 Lawson, ECLuci, DKGhosh, SKinney, WAReynolds, CHQi, JSmith, CEWang, YMinor, LKHaertlein, BJParry, TJDamiano, BPMaryanoff, BE Nonpeptide urotensin-II receptor antagonists: a new ligand class based on piperazino-phthalimide and piperazino-isoindolinone subunits. J Med Chem 52:7432-45 (2009)  
Target
Name:
Urotensin-2 receptor
Synonyms:
G-protein coupled receptor 14 UR-II-R UTS2R Urotensin-II
Type:
Enzyme Catalytic Domain
Mol. Mass.:
42159.71
Organism:
Homo sapiens (Human)
Description:
Urotensin-II UTS2R HUMAN::Q9UKP6
Residue:
389
  
Inhibitor
Name:
BDBM50302231
Synonyms:
2-((R)-1-(3,4-dimethoxyphenyl)ethyl)-4-(4-((R)-1-phenylethyl)piperazin-1-yl)isoindoline-1,3-dione | CHEMBL571683
Type:
Small organic molecule
Emp. Form.:
C30H33N3O4
Mol. Mass.:
499.6007
SMILES:
COc1ccc(cc1OC)[C@@H](C)N1C(=O)c2cccc(N3CCN(CC3)[C@H](C)c3ccccc3)c2C1=O
: