Target
Corticotropin-releasing factor receptor 1
Ligand
BDBM50302584
Substrate
Meas. Tech.
ChEMBL_594612 (CHEMBL1037909)
Ki
85±n/a nM
Citation
 Miller, DCKlute, WCalabrese, ABrown, AD Optimising metabolic stability in lipophilic chemical space: the identification of a metabolically stable pyrazolopyrimidine CRF-1 receptor antagonist. Bioorg Med Chem Lett 19:6144-7 (2009)  
Target
Name:
Corticotropin-releasing factor receptor 1
Synonyms:
CRF-R CRF1 CRFR1 CRH-R 1 CRHR1 Corticotropin-releasing factor receptor 1 (CRF-1) Corticotropin-releasing hormone receptor 1
Type:
Enzyme
Mol. Mass.:
50744.31
Organism:
Homo sapiens (Human)
Description:
P34998
Residue:
444
  
Inhibitor
Name:
BDBM50302584
Synonyms:
1-(4-methoxy-2-methylphenyl)-6-methyl-N-(pentan-3-yl)-1H-pyrazolo[3,4-d]pyrimidin-4-amine | CHEMBL576664
Type:
Small organic molecule
Emp. Form.:
C19H25N5O
Mol. Mass.:
339.4347
SMILES:
CCC(CC)Nc1nc(C)nc2n(ncc12)-c1ccc(OC)cc1C
: