Target
Kappa-type opioid receptor
Ligand
BDBM50001033
Substrate
Meas. Tech.
ChEMBL_594974 (CHEMBL1038965)
Ki
2.2±n/a nM
Citation
 Hsin, LWChang, LTRothman, RBDersch, CMFishback, JAMatsumoto, RR Synthesis and opioid activity of enantiomeric N-substituted 2,3,4,4a,5,6,7,7a-octahydro-1H-benzofuro[3,2-e]isoquinolines. J Med Chem 53:1392-6 (2010)  
Target
Name:
Kappa-type opioid receptor
Synonyms:
K-OR-1 Kappa-opioid receptor (KOR) Kappa-type opioid receptor (KOR) OPIATE Kappa OPRK1 kappa opioid receptor (KOR)
Type:
G Protein-Coupled Receptor (GPCR)
Mol. Mass.:
42648.76
Organism:
Homo sapiens (Human)
Description:
P41145
Residue:
380
  
Inhibitor
Name:
BDBM50001033
Synonyms:
(-)-Pentazocine REL-PENTAZOCINE
Type:
Small organic molecule
Emp. Form.:
C19H27NO
Mol. Mass.:
285.4238
SMILES:
[H][C@]12[#6]-c3ccc(-[#8])cc3[C@]([#6])([#6]-[#6]-[#7]1-[#6]\[#6]=[#6](/[#6])-[#6])[#6@@H]2-[#6]
: