Target
Mu-type opioid receptor
Ligand
BDBM50001033
Substrate
Meas. Tech.
ChEMBL_594975 (CHEMBL1038966)
Ki
3.9±n/a nM
Citation
 Hsin, LWChang, LTRothman, RBDersch, CMFishback, JAMatsumoto, RR Synthesis and opioid activity of enantiomeric N-substituted 2,3,4,4a,5,6,7,7a-octahydro-1H-benzofuro[3,2-e]isoquinolines. J Med Chem 53:1392-6 (2010)  
Target
Name:
Mu-type opioid receptor
Synonyms:
M-OR-1 MOR-1 MUOR1 Mu opiate receptor OPRM1 hMOP | mu-type opioid receptor isoform MOR-1
Type:
G Protein-Coupled Receptor (GPCR)
Mol. Mass.:
44789.51
Organism:
Homo sapiens (Human)
Description:
P35372
Residue:
400
  
Inhibitor
Name:
BDBM50001033
Synonyms:
(-)-Pentazocine REL-PENTAZOCINE
Type:
Small organic molecule
Emp. Form.:
C19H27NO
Mol. Mass.:
285.4238
SMILES:
[H][C@]12[#6]-c3ccc(-[#8])cc3[C@]([#6])([#6]-[#6]-[#7]1-[#6]\[#6]=[#6](/[#6])-[#6])[#6@@H]2-[#6]
: