Target
Amine oxidase [flavin-containing] A
Ligand
BDBM50304157
Substrate
Meas. Tech.
ChEMBL_601025 (CHEMBL1069162)
IC50
95200±n/a nM
Citation
 Gökhan-Kelekçi, NSimsek, OOErcan, AYelekçi, KSahin, ZSIsik, SUçar, GBilgin, AA Synthesis and molecular modeling of some novel hexahydroindazole derivatives as potent monoamine oxidase inhibitors. Bioorg Med Chem 17:6761-72 (2009)  
Target
Name:
Amine oxidase [flavin-containing] A
Synonyms:
AOFA_RAT Amine oxidase [flavin-containing] A Monoamine Oxidase Type A (MAO-A) Monoamine oxidase A (MAO-A) Monoamine oxidase type A (MAOA)
Type:
Enzyme
Mol. Mass.:
59515.21
Organism:
Rattus norvegicus (rat)
Description:
Residue:
526
  
Inhibitor
Name:
BDBM50304157
Synonyms:
3-(2-Thienyl)-2-thiocarbamoyl-2,3,4,5,6,7-hexahydro-1Hindazol | CHEMBL592976
Type:
Small organic molecule
Emp. Form.:
C12H15N3S2
Mol. Mass.:
265.398
SMILES:
NC(=S)N1N=C2CCCCC2C1c1cccs1
: