Target
Carboxypeptidase B2
Ligand
BDBM50305348
Substrate
Meas. Tech.
ChEMBL_603568 (CHEMBL1069123)
Ki
8.2±n/a nM
Citation
 Owen, DRBull, DJBunnage, MEGlossop, MSMaguire, RJStrang, RS Oxygenated analogues of UK-396082 as inhibitors of activated thrombin activatable fibrinolysis inhibitor. Bioorg Med Chem Lett 20:92-6 (2010)  
Target
Name:
Carboxypeptidase B2
Synonyms:
CBPB2_HUMAN CPU Carboxypeptidase B2 isoform A Plasma carboxypeptidase B Thrombin-activable fibrinolysis inhibitor | pCPB
Type:
Enzyme
Mol. Mass.:
48432.74
Organism:
Homo sapiens (Human)
Description:
Q96IY4
Residue:
423
  
Inhibitor
Name:
BDBM50305348
Synonyms:
(S)-2-(2-aminoethoxy)-3-(1-(2-cyclohexylethyl)-1H-imidazol-4-yl)propanoic acid | CHEMBL594359
Type:
Small organic molecule
Emp. Form.:
C16H27N3O3
Mol. Mass.:
309.4039
SMILES:
NCCO[C@@H](Cc1cn(CCC2CCCCC2)cn1)C(O)=O
: