Target
D(1A) dopamine receptor
Ligand
BDBM50306322
Substrate
Meas. Tech.
ChEMBL_609554 (CHEMBL1073807)
Ki
0.5±n/a nM
Citation
 Qiang, LSasikumar, TKBurnett, DASu, JTang, HYe, YMazzola, RDZhu, ZMcKittrick, BAGreenlee, WJFawzi, ASmith, MZhang, HLachowicz, JE Discovery of new SCH 39166 analogs as potent and selective dopamine D1 receptor antagonists. Bioorg Med Chem Lett 20:836-40 (2010)  
Target
Name:
D(1A) dopamine receptor
Synonyms:
DA D1 receptor DRD1 Dopamine D1 receptor Dopamine D1A
Type:
Enzyme
Mol. Mass.:
49303.43
Organism:
Homo sapiens (Human)
Description:
P21728
Residue:
446
  
Inhibitor
Name:
BDBM50306322
Synonyms:
CHEMBL597909 | N-((6aS,13bR)-11-chloro-12-hydroxy-7-methyl-6,6a,7,8,9,13b-hexahydro-5H-benzo[d]naphtho[2,1-b]azepin-3-yl)methanesulfonamide
Type:
Small organic molecule
Emp. Form.:
C20H23ClN2O3S
Mol. Mass.:
406.926
SMILES:
CN1CCc2cc(Cl)c(O)cc2[C@@H]2[C@@H]1CCc1cc(NS(C)(=O)=O)ccc21
: