Target
Amine oxidase [flavin-containing] A
Ligand
BDBM50245966
Substrate
Meas. Tech.
ChEMBL_612907 (CHEMBL1069506)
IC50
5560±n/a nM
Citation
 Karuppasamy, MMahapatra, MYabanoglu, SUcar, GSinha, BNBasu, AMishra, NSharon, AKulandaivelu, UJayaprakash, V Development of selective and reversible pyrazoline based MAO-A inhibitors: Synthesis, biological evaluation and docking studies. Bioorg Med Chem 18:1875-81 (2010)  
Target
Name:
Amine oxidase [flavin-containing] A
Synonyms:
AOFA_HUMAN MAO-A Monoamine oxidase Monoamine oxidase type A (MAO A) Monoamine oxidase type A (MAOA)
Type:
Protein
Mol. Mass.:
59689.53
Organism:
Homo sapiens (Human)
Description:
P21397
Residue:
527
  
Inhibitor
Name:
BDBM50245966
Synonyms:
3-(2-hydroxyphenyl)-N-phenyl-5-(thiophen-2-yl)-4,5-dihydro-1H-pyrazole-1-carbothioamide | CHEMBL462549
Type:
Small organic molecule
Emp. Form.:
C20H17N3OS2
Mol. Mass.:
379.498
SMILES:
Oc1ccccc1C1=NN(C(C1)c1cccs1)C(=S)Nc1ccccc1
: