Target
Integrin alpha-V/beta-3
Ligand
BDBM50308727
Substrate
Meas. Tech.
ChEMBL_607327 (CHEMBL1064843)
IC50
3.8±n/a nM
Citation
 Dal Pozzo, ANi, MHEsposito, EDallavalle, SMusso, LBargiotti, APisano, CVesci, LBucci, FCastorina, MFoderà, RGiannini, GAulicino, CPenco, S Novel tumor-targeted RGD peptide-camptothecin conjugates: synthesis and biological evaluation. Bioorg Med Chem 18:64-72 (2010)  
Target
Name:
Integrin alpha-V/beta-3
Synonyms:
ITGAV/ITGB3 | Integrin beta-3/Vitronectin receptor alpha
Type:
Enzyme
Mol. Mass.:
Description:
Components:
This complex has 2 components.
Component 1
Name:
Integrin alpha-V
Synonyms:
ITAV_HUMAN Integrin alpha-V/alpha-5 VNRA Vitronectin receptor | Vitronectin receptor subunit alpha
Type:
PROTEIN
Mol. Mass.:
116024.92
Organism:
Homo sapiens (Human)
Description:
ChEMBL_582336
Residue:
1048
  
Component 2
Name:
Integrin beta-3
Synonyms:
CD_antigen=CD61 GPIIIa ITGB3 Platelet membrane glycoprotein IIIa
Type:
Protein
Mol. Mass.:
87038.91
Organism:
Homo sapiens (Human)
Description:
P05106
Residue:
788
  
Inhibitor
Name:
BDBM50308727
Synonyms:
2-((2S,5R,8S,11S)-5-benzyl-11-(3-guanidinopropyl)-8-(4-(13-hydrazinyl-3,13-dioxo-5,8,11-trioxa-2-azatridecyl)phenyl)-3,6,9,12,15-pentaoxo-1,4,7,10,13-pentaazacyclopentadecan-2-yl)acetic acid | CHEMBL590646
Type:
Small organic molecule
Emp. Form.:
C38H53N11O12
Mol. Mass.:
855.8939
SMILES:
[#7]-[#7]-[#6](=O)-[#6]-[#8]-[#6]-[#6]-[#8]-[#6]-[#6]-[#8]-[#6]-[#6](=O)-[#7]-[#6]-c1ccc(cc1)-[#6@@H]-1-[#7]-[#6](=O)-[#6@@H](-[#6]-c2ccccc2)-[#7]-[#6](=O)-[#6@H](-[#6]-[#6](-[#8])=O)-[#7]-[#6](=O)-[#6]-[#7]-[#6](=O)-[#6@H](-[#6]-[#6]-[#6]\[#7]=[#6](\[#7])-[#7])-[#7]-[#6]-1=O
: