Target
Fatty-acid amide hydrolase 1 [30-579]
Ligand
BDBM50308976
Substrate
Meas. Tech.
ChEMBL_611783 (CHEMBL1066440)
IC50
3600±n/a nM
Citation
 Forster, LLudwig, JKaptur, MBovens, SElfringhoff, ASHoltfrerich, ALehr, M 1-Indol-1-yl-propan-2-ones and related heterocyclic compounds as dual inhibitors of cytosolic phospholipase A(2)alpha and fatty acid amide hydrolase. Bioorg Med Chem 18:945-52 (2010)  
Target
Name:
Fatty-acid amide hydrolase 1 [30-579]
Synonyms:
Anandamide amidohydrolase 1 Faah Fatty Acid Amide Hydrolase Fatty-acid amide hydrolase (FAAH) Fatty-acid amide hydrolase 1 (FAAH) Oleamide hydrolase 1
Type:
Single-pass membrane protein; homodimer
Mol. Mass.:
60474.00
Organism:
Rattus norvegicus (rat)
Description:
P97612 (aa 30-579)
Residue:
550
  
Inhibitor
Name:
BDBM50308976
Synonyms:
1-(3-(4-octylphenoxy)-2-oxopropyl)-1H-pyrrole-3-carboxylic acid | CHEMBL598976
Type:
Small organic molecule
Emp. Form.:
C22H29NO4
Mol. Mass.:
371.47
SMILES:
CCCCCCCCc1ccc(OCC(=O)Cn2ccc(c2)C(O)=O)cc1
: