Target
Sphingomyelin phosphodiesterase 2
Ligand
BDBM50308981
Substrate
Meas. Tech.
ChEMBL_611790 (CHEMBL1066447)
IC50
>100000±n/a nM
Citation
 Roth, AGRedmer, SArenz, C Development of carbohydrate-derived inhibitors of acid sphingomyelinase. Bioorg Med Chem 18:939-44 (2010)  
Target
Name:
Sphingomyelin phosphodiesterase 2
Synonyms:
NSMA_RAT Smpd2
Type:
PROTEIN
Mol. Mass.:
47651.22
Organism:
Rattus norvegicus
Description:
ChEMBL_611790
Residue:
422
  
Inhibitor
Name:
BDBM50308981
Synonyms:
6-O-Hexylsulfonyl-D-glucose-2,4-bisphosphate | CHEMBL600243
Type:
Small organic molecule
Emp. Form.:
C12H26O14P2S
Mol. Mass.:
488.339
SMILES:
CCCCCCS(=O)(=O)OC[C@H]1OC(O)[C@H](OP(O)(O)=O)[C@@H](O)[C@@H]1OP(O)(O)=O
: