Target
Adenosine receptor A2a
Ligand
BDBM21220
Substrate
Meas. Tech.
ChEMBL_609497 (CHEMBL1071769)
IC50
16±n/a nM
Citation
 Beattie, DBrearley, ABrown, ZCharlton, SJCox, BFairhurst, RAFozard, JRGedeck, PKirkham, PMeja, KNanson, LNeef, JOakman, HSpooner, GTaylor, RJTurner, RJWest, RWoodward, H Synthesis and evaluation of two series of 4'-aza-carbocyclic nucleosides as adenosine A2A receptor agonists. Bioorg Med Chem Lett 20:1219-24 (2010)  
Target
Name:
Adenosine receptor A2a
Synonyms:
A2A adenosine receptor (hA2A) ADENOSINE A2 ADORA2 Adenosine A2A receptor (A2AAR)
Type:
G Protein-Coupled Receptor (GPCR)
Mol. Mass.:
44716.46
Organism:
Homo sapiens (Human)
Description:
P29274
Residue:
412
  
Inhibitor
Name:
BDBM21220
Synonyms:
(2S,3S,4R,5R)-5-(6-amino-9H-purin-9-yl)-N-ethyl-3,4-dihydroxyoxolane-2-carboxamide Adenosine, N6-Ethyl-carboxamido CHEMBL464859 NECA
Type:
Antineoplastic Agent
Emp. Form.:
C12H16N6O4
Mol. Mass.:
308.2932
SMILES:
CCNC(=O)[C@H]1O[C@H]([C@H](O)[C@@H]1O)n1cnc2c(N)ncnc12
: