Target
cAMP-specific 3',5'-cyclic phosphodiesterase 4D
Ligand
BDBM50310366
Substrate
Meas. Tech.
ChEMBL_622099 (CHEMBL1114098)
Kd
3800±n/a nM
Citation
 Mouri, ROishi, TTorikai, KUjihara, SMatsumori, NMurata, MOshima, Y Surface plasmon resonance-based detection of ladder-shaped polyethers by inhibition detection method. Bioorg Med Chem Lett 19:2824-8 (2009)  
Target
Name:
cAMP-specific 3',5'-cyclic phosphodiesterase 4D
Synonyms:
3',5'-cyclic phosphodiesterase PDE43 PDE4D_HUMAN | Phosphodiesterase 4D
Type:
Protein
Mol. Mass.:
91092.69
Organism:
Homo sapiens (Human)
Description:
Q08499
Residue:
809
  
Inhibitor
Name:
BDBM50310366
Synonyms:
Brevetoxin | CHEMBL1077122
Type:
Small organic molecule
Emp. Form.:
C49H68O14
Mol. Mass.:
881.0558
SMILES:
C[C@@H]1C[C@@H]2O[C@@H]3C[C@@H]4OC(=O)C=C(C)[C@H]4O[C@@]3(C)C[C@H]2O[C@H]2CC[C@@]3(C)O[C@@]4(C)C[C@H]5O[C@H]6C[C@H]7O[C@@]8(C)[C@@H](O)C[C@@H](CC(=C)C=O)O[C@@H]8C[C@@H]7O[C@@H]6\C=C/C[C@@H]5O[C@@H]4C[C@@H]3O[C@H]12
: