Target
Receptor-type tyrosine-protein kinase FLT3
Ligand
BDBM50310635
Substrate
Meas. Tech.
ChEMBL_620389 (CHEMBL1112284)
Kd
10.1±n/a nM
Citation
 Patel, HKGrotzfeld, RMLai, AGMehta, SAMilanov, ZVChao, QSprankle, KGCarter, TAVelasco, AMFabian, MAJames, JTreiber, DKLockhart, DJZarrinkar, PPBhagwat, SS Arylcarboxyamino-substituted diaryl ureas as potent and selective FLT3 inhibitors. Bioorg Med Chem Lett 19:5182-5 (2009)  
Target
Name:
Receptor-type tyrosine-protein kinase FLT3
Synonyms:
CD135 FL cytokine receptor FLK2 FLT3 Fetal liver kinase-2 Fms-like tyrosine kinase 3 (Flt-3) STK-1 Stem cell tyrosine kinase 1
Type:
Enzyme
Mol. Mass.:
112888.62
Organism:
Homo sapiens (Human)
Description:
P36888
Residue:
993
  
Inhibitor
Name:
BDBM50310635
Synonyms:
CHEMBL1082075 | N-(4-(3-(5-tert-butylisoxazol-3-yl)ureido)phenyl)isonicotinamide
Type:
Small organic molecule
Emp. Form.:
C20H21N5O3
Mol. Mass.:
379.4124
SMILES:
CC(C)(C)c1cc(NC(=O)Nc2ccc(NC(=O)c3ccncc3)cc2)no1
: