Target
cAMP-dependent protein kinase catalytic subunit alpha
Ligand
BDBM50311405
Substrate
Meas. Tech.
ChEMBL_622265 (CHEMBL1110410)
IC50
82±n/a nM
Citation
 Enkvist, EKriisa, MRoben, MKadak, GRaidaru, GUri, A Effect of the structure of adenosine mimic of bisubstrate-analog inhibitors on their activity towards basophilic protein kinases. Bioorg Med Chem Lett 19:6098-101 (2009)  
Target
Name:
cAMP-dependent protein kinase catalytic subunit alpha
Synonyms:
KAPCA_HUMAN PKACA cAMP-dependent protein kinase (PKA) cAMP-dependent protein kinase catalytic subunit alpha cAMP-dependent protein kinase catalytic subunit alpha (PKACA) cAMP-dependent protein kinase catalytic subunit alpha isoform 1 | cAMP-dependent protein kinase, alpha-catalytic subunit
Type:
Enzyme Catalytic Subunit
Mol. Mass.:
40598.73
Organism:
Homo sapiens (Human)
Description:
Residue:
351
  
Inhibitor
Name:
BDBM50311405
Synonyms:
CHEMBL1077369 | N-((6R,9R,19R)-1-amino-19-(4-aminobutyl)-6-carbamoyl-9-(3-guanidinopropyl)-1-imino-8,11,18,21-tetraoxo-2,7,10,17,20-pentaazahexacosan-26-yl)-5-(2-aminopyrimidin-4-yl)thiophene-2-carboxamide
Type:
Small organic molecule
Emp. Form.:
C39H66N16O6S
Mol. Mass.:
887.11
SMILES:
[#7]-[#6]-[#6]-[#6]-[#6]-[#6@@H](-[#7]-[#6](=O)-[#6]-[#6]-[#6]-[#6]-[#6]-[#7]-[#6](=O)-c1ccc(s1)-c1ccnc(-[#7])n1)-[#6](=O)-[#7]-[#6]-[#6]-[#6]-[#6]-[#6]-[#6](=O)-[#7]-[#6@H](-[#6]-[#6]-[#6]\[#7]=[#6](\[#7])-[#7])-[#6](=O)-[#7]-[#6@H](-[#6]-[#6]-[#6]\[#7]=[#6](\[#7])-[#7])-[#6](-[#7])=O
: