Target
Insulin receptor
Ligand
BDBM50311921
Substrate
Meas. Tech.
ChEMBL_619940 (CHEMBL1113982)
IC50
4±n/a nM
Citation
 Zhang, GRen, PGray, NSSim, TWang, XLiu, YChe, JDong, WTian, SSSandberg, MLSpalding, TARomeo, RIskandar, MWang, ZSeidel, HMKaranewsky, DSHe, Y Discovery of pyrimidine benzimidazoles as Src-family selective Lck inhibitors. Part II. Bioorg Med Chem Lett 19:6691-5 (2009)  
Target
Name:
Insulin receptor
Synonyms:
INSR INSR_HUMAN Insulin receptor beta subunit
Type:
Receptor Tyrosine Kinase
Mol. Mass.:
156322.60
Organism:
Homo sapiens (Human)
Description:
P06213
Residue:
1382
  
Inhibitor
Name:
BDBM50311921
Synonyms:
CHEMBL1086731 | N-(3-(1-(6-aminopyrimidin-4-yl)-1H-benzo[d]imidazol-2-ylamino)-4-methylphenyl)-5-tert-butylthiophene-2-carboxamide
Type:
Small organic molecule
Emp. Form.:
C27H27N7OS
Mol. Mass.:
497.615
SMILES:
Cc1ccc(NC(=O)c2ccc(s2)C(C)(C)C)cc1Nc1nc2ccccc2n1-c1cc(N)ncn1
: