Target
Cannabinoid receptor 1
Ligand
BDBM50312584
Substrate
Meas. Tech.
ChEMBL_615551 (CHEMBL1107820)
Ki
5.9±n/a nM
Citation
 Meng, TWang, JPeng, HFang, GLi, MXiong, BXie, XZhang, YWang, XShen, J Discovery of benzhydrylpiperazine derivatives as CB1 receptor inverse agonists via privileged structure-based approach. Eur J Med Chem 45:1133-9 (2010)  
Target
Name:
Cannabinoid receptor 1
Synonyms:
CANN6 CB-R CNR CNR1_HUMAN Cannabinoid receptor Cannabinoid receptor 1 (brain)
Type:
G Protein-Coupled Receptor (GPCR)
Mol. Mass.:
52868.96
Organism:
Homo sapiens (Human)
Description:
P21554
Residue:
472
  
Inhibitor
Name:
BDBM50312584
Synonyms:
CHEMBL1087874 | N-cyclohexyl-4-((2,5-dichlorophenyl)(phenyl)methyl)piperazine-1-carboxamide
Type:
Small organic molecule
Emp. Form.:
C24H29Cl2N3O
Mol. Mass.:
446.413
SMILES:
Clc1ccc(Cl)c(c1)C(N1CCN(CC1)C(=O)NC1CCCCC1)c1ccccc1
: