Target
Cannabinoid receptor 1
Ligand
BDBM50312590
Substrate
Meas. Tech.
ChEMBL_615551 (CHEMBL1107820)
Ki
732±n/a nM
Citation
 Meng, TWang, JPeng, HFang, GLi, MXiong, BXie, XZhang, YWang, XShen, J Discovery of benzhydrylpiperazine derivatives as CB1 receptor inverse agonists via privileged structure-based approach. Eur J Med Chem 45:1133-9 (2010)  
Target
Name:
Cannabinoid receptor 1
Synonyms:
CANN6 CB-R CNR CNR1_HUMAN Cannabinoid receptor Cannabinoid receptor 1 (brain)
Type:
G Protein-Coupled Receptor (GPCR)
Mol. Mass.:
52868.96
Organism:
Homo sapiens (Human)
Description:
P21554
Residue:
472
  
Inhibitor
Name:
BDBM50312590
Synonyms:
1-(cyclopentylcarbonyl)-4-[(2,4-dichlorophenyl)(phenyl)methyl]piperazine | CHEMBL1087521
Type:
Small organic molecule
Emp. Form.:
C23H26Cl2N2O
Mol. Mass.:
417.371
SMILES:
Clc1ccc(C(N2CCN(CC2)C(=O)C2CCCC2)c2ccccc2)c(Cl)c1
: