Target
Cannabinoid receptor 1
Ligand
BDBM50312592
Substrate
Meas. Tech.
ChEMBL_615551 (CHEMBL1107820)
Ki
5.9±n/a nM
Citation
 Meng, TWang, JPeng, HFang, GLi, MXiong, BXie, XZhang, YWang, XShen, J Discovery of benzhydrylpiperazine derivatives as CB1 receptor inverse agonists via privileged structure-based approach. Eur J Med Chem 45:1133-9 (2010)  
Target
Name:
Cannabinoid receptor 1
Synonyms:
CANN6 CB-R CNR CNR1_HUMAN Cannabinoid receptor Cannabinoid receptor 1 (brain)
Type:
G Protein-Coupled Receptor (GPCR)
Mol. Mass.:
52868.96
Organism:
Homo sapiens (Human)
Description:
P21554
Residue:
472
  
Inhibitor
Name:
BDBM50312592
Synonyms:
1-(1-adamantylcarbonyl)-4-[(2,4-dichlorophenyl)(phenyl)methyl]piperazine | CHEMBL1095690
Type:
Small organic molecule
Emp. Form.:
C28H32Cl2N2O
Mol. Mass.:
483.472
SMILES:
Clc1ccc(C(N2CCN(CC2)C(=O)C23CC4CC(CC(C4)C2)C3)c2ccccc2)c(Cl)c1
: