Target
Cannabinoid receptor 2
Ligand
BDBM50312584
Substrate
Meas. Tech.
ChEMBL_615552 (CHEMBL1107821)
Ki
899±n/a nM
Citation
 Meng, TWang, JPeng, HFang, GLi, MXiong, BXie, XZhang, YWang, XShen, J Discovery of benzhydrylpiperazine derivatives as CB1 receptor inverse agonists via privileged structure-based approach. Eur J Med Chem 45:1133-9 (2010)  
Target
Name:
Cannabinoid receptor 2
Synonyms:
CANNABINOID CB2 CB2 CB2B CNR2_HUMAN Cannabinoid CB2 receptor Cannabinoid receptor 2 (CB2R) | hCB2
Type:
G Protein-Coupled Receptor (GPCR)
Mol. Mass.:
39690.94
Organism:
Homo sapiens (Human)
Description:
P34972
Residue:
360
  
Inhibitor
Name:
BDBM50312584
Synonyms:
CHEMBL1087874 | N-cyclohexyl-4-((2,5-dichlorophenyl)(phenyl)methyl)piperazine-1-carboxamide
Type:
Small organic molecule
Emp. Form.:
C24H29Cl2N3O
Mol. Mass.:
446.413
SMILES:
Clc1ccc(Cl)c(c1)C(N1CCN(CC1)C(=O)NC1CCCCC1)c1ccccc1
: