Target
Prothrombin
Ligand
BDBM50312657
Substrate
Meas. Tech.
ChEMBL_617811 (CHEMBL1100517)
Ki
47±n/a nM
Citation
 Lu, TMarkotan, TBallentine, SKGiardino, ECSpurlino, JCrysler, CSBrown, KMaryanoff, BETomczuk, BEDamiano, BPShukla, UEnd, DAndrade-Gordon, PBone, RFPlayer, MR Discovery and clinical evaluation of 1-{N-[2-(amidinoaminooxy)ethyl]amino}carbonylmethyl-6-methyl-3-[2,2-difluoro-2-phenylethylamino]pyrazinone (RWJ-671818), a thrombin inhibitor with an oxyguanidine P1 motif. J Med Chem 53:1843-56 (2010)  
Target
Name:
Prothrombin
Synonyms:
Activation peptide fragment 1 Coagulation factor II Prothrombin precursor Thrombin heavy chain | Thrombin light chain
Type:
Protein
Mol. Mass.:
70029.57
Organism:
Homo sapiens (Human)
Description:
P00734
Residue:
622
  
Inhibitor
Name:
BDBM50312657
Synonyms:
1-{N-[2-(Amidinoaminooxy)ethyl]amino}carbonylmethyl-6-methyl-3-(2-[4-trifluoromethylphenyl]ethylamino)pyrazinone | CHEMBL1083190
Type:
Small organic molecule
Emp. Form.:
C19H24F3N7O3
Mol. Mass.:
455.4342
SMILES:
[#6]-c1cnc(-[#7]-[#6]-[#6]-c2ccc(cc2)C(F)(F)F)c(=O)n1-[#6]-[#6](=O)-[#7]-[#6]-[#6]-[#8]\[#7]=[#6](\[#7])-[#7]
: