Target
Cholinesterase
Ligand
BDBM50312803
Substrate
Meas. Tech.
ChEMBL_615850 (CHEMBL1101960)
IC50
540±n/a nM
Citation
 Takahashi, JHijikuro, IKihara, TMurugesh, MGFuse, SKunimoto, RTsumura, YAkaike, ANiidome, TOkuno, YTakahashi, TSugimoto, H Design, synthesis, evaluation and QSAR analysis of N(1)-substituted norcymserine derivatives as selective butyrylcholinesterase inhibitors. Bioorg Med Chem Lett 20:1718-20 (2010)  
Target
Name:
Cholinesterase
Synonyms:
Acylcholine acylhydrolase Butyrylcholine esterase CHLE_MOUSE Pseudocholinesterase
Type:
Protein
Mol. Mass.:
68465.99
Organism:
Mus musculus (Mouse)
Description:
Q03311
Residue:
603
  
Inhibitor
Name:
BDBM50312803
Synonyms:
(3aS,8aR)-3a,8-dimethyl-1-phenethyl-1,2,3,3a,8,8a-hexahydropyrrolo[2,3-b]indol-5-yl 4-isopropylphenylcarbamate CHEMBL1080386
Type:
Small organic molecule
Emp. Form.:
C30H35N3O2
Mol. Mass.:
469.6178
SMILES:
CC(C)c1ccc(NC(=O)Oc2ccc3N(C)[C@H]4N(CCc5ccccc5)CC[C@@]4(C)c3c2)cc1
: