Target
Cholinesterase
Ligand
BDBM50312888
Substrate
Meas. Tech.
ChEMBL_615895 (CHEMBL1102909)
IC50
1400±n/a nM
Citation
 Takahashi, JHijikuro, IKihara, TMurugesh, MGFuse, STsumura, YAkaike, ANiidome, TTakahashi, TSugimoto, H Design, synthesis and evaluation of carbamate-modified (-)-N(1)-phenethylnorphysostigmine derivatives as selective butyrylcholinesterase inhibitors. Bioorg Med Chem Lett 20:1721-3 (2010)  
Target
Name:
Cholinesterase
Synonyms:
Acylcholine acylhydrolase Butyrylcholine esterase CHLE_MOUSE Pseudocholinesterase
Type:
Protein
Mol. Mass.:
68465.99
Organism:
Mus musculus (Mouse)
Description:
Q03311
Residue:
603
  
Inhibitor
Name:
BDBM50312888
Synonyms:
3alpha,8-dimethyl-1-phenethyl-1,2,3,3alpha,8,8alpha-hexahydropyrrolo[2,3-b]indol-5-yl4-(hexyloxy)phenylcarbamate | CHEMBL1081457
Type:
Small organic molecule
Emp. Form.:
C33H41N3O3
Mol. Mass.:
527.6969
SMILES:
CCCCCCOc1ccc(NC(=O)Oc2ccc3N(C)[C@H]4N(CCc5ccccc5)CC[C@@]4(C)c3c2)cc1
: