Target
Adenosine receptor A2a
Ligand
BDBM50312960
Substrate
Meas. Tech.
ChEMBL_616079 (CHEMBL1102042)
Ki
286±n/a nM
Citation
 Eastwood, PGonzalez, JParedes, SNueda, ADomenech, TAlberti, JVidal, B Discovery of N-(5,6-diarylpyridin-2-yl)amide derivatives as potent and selective A(2B) adenosine receptor antagonists. Bioorg Med Chem Lett 20:1697-700 (2010)  
Target
Name:
Adenosine receptor A2a
Synonyms:
A2A adenosine receptor (hA2A) ADENOSINE A2 ADORA2 Adenosine A2A receptor (A2AAR)
Type:
G Protein-Coupled Receptor (GPCR)
Mol. Mass.:
44716.46
Organism:
Homo sapiens (Human)
Description:
P29274
Residue:
412
  
Inhibitor
Name:
BDBM50312960
Synonyms:
CHEMBL1082208 | N-(2-(3-fluorophenyl)-3,4'-bipyridin-6-yl)acetamide
Type:
Small organic molecule
Emp. Form.:
C18H14FN3O
Mol. Mass.:
307.3217
SMILES:
CC(=O)Nc1ccc(-c2ccncc2)c(n1)-c1cccc(F)c1
: