Target
D(1A) dopamine receptor
Ligand
BDBM50313917
Substrate
Meas. Tech.
ChEMBL_615494 (CHEMBL1105124)
Ki
4.2±n/a nM
Citation
 Robaa, DEnzensperger, CAbul Azm, Sel DEl Khawass, el SEl Sayed, OLehmann, J Dopamine receptor ligands. Part 18: (1) modification of the structural skeleton of indolobenzazecine-type dopamine receptor antagonists. J Med Chem 53:2646-50 (2010)  
Target
Name:
D(1A) dopamine receptor
Synonyms:
DA D1 receptor DRD1 Dopamine D1 receptor Dopamine D1A
Type:
Enzyme
Mol. Mass.:
49303.43
Organism:
Homo sapiens (Human)
Description:
P21728
Residue:
446
  
Inhibitor
Name:
BDBM50313917
Synonyms:
6-Methyl-5,6,7,8,13,15-hexahydro-4H-indolo[4,3a,3-fg][3]benzazacycloundecene | CHEMBL1087300
Type:
Small organic molecule
Emp. Form.:
C20H22N2
Mol. Mass.:
290.4021
SMILES:
CN1CCc2ccccc2Cc2c[nH]c3cccc(CC1)c23
: