Target
Carbonic anhydrase 2
Ligand
BDBM50314769
Substrate
Meas. Tech.
ChEMBL_626765 (CHEMBL1106334)
Ki
25±n/a nM
Citation
 Vullo, DNishimori, IScozzafava, AKöhler, SWinum, JYSupuran, CT Inhibition studies of a beta-carbonic anhydrase from Brucella suis with a series of water soluble glycosyl sulfanilamides. Bioorg Med Chem Lett 20:2178-82 (2010)  
Target
Name:
Carbonic anhydrase 2
Synonyms:
CA-II CAC Carbonate dehydratase II Carbonic anhydrase 2 (CA-II) Carbonic anhydrase C Carbonic anhydrase II (CA-II) Carbonic anhydrase II (hCA II) | Carbonic anhydrase isoenzyme II (hCA II)
Type:
Enzyme
Mol. Mass.:
29250.71
Organism:
Homo sapiens (Human)
Description:
P00918
Residue:
260
  
Inhibitor
Name:
BDBM50314769
Synonyms:
4-((2R,3R,4S,5R,6R)-3,4,5-trihydroxy-6-(hydroxymethyl)tetrahydro-2H-pyran-2-ylamino)benzenesulfonamide | CHEMBL1090523
Type:
Small organic molecule
Emp. Form.:
C12H18N2O7S
Mol. Mass.:
334.346
SMILES:
NS(=O)(=O)c1ccc(N[C@@H]2O[C@H](CO)[C@H](O)[C@H](O)[C@H]2O)cc1
: