Target
Toll-like receptor 7
Ligand
BDBM50189516
Substrate
Meas. Tech.
ChEMBL_625707 (CHEMBL1103537)
EC50
399.4±n/a nM
Citation
 Kurimoto, AHashimoto, KNakamura, TNorimura, KOgita, HTakaku, HBonnert, RMcInally, TWada, HIsobe, Y Synthesis and biological evaluation of 8-oxoadenine derivatives as toll-like receptor 7 agonists introducing the antedrug concept. J Med Chem 53:2964-72 (2010)  
Target
Name:
Toll-like receptor 7
Synonyms:
ORF Names:UNQ248/PRO285 TLR7_HUMAN | Toll-like receptor 7 (TLR7)
Type:
Enzyme
Mol. Mass.:
120945.35
Organism:
Homo sapiens (Human)
Description:
Q9NYK1
Residue:
1049
  
Inhibitor
Name:
BDBM50189516
Synonyms:
6-amino-9-benzyl-2-(2-methoxyethoxy)-7H-purin-8(9H)-one 9-benzyl-2-(2-methoxyethoxy)-8-oxoadenine CHEMBL210884 | SM-360320
Type:
Small organic molecule
Emp. Form.:
C15H17N5O3
Mol. Mass.:
315.3272
SMILES:
COCCOc1nc(N)c2[nH]c(=O)n(Cc3ccccc3)c2n1
: