Target
Nitric oxide synthase, brain
Ligand
BDBM50316606
Substrate
Meas. Tech.
ChEMBL_631956 (CHEMBL1104712)
IC50
65000±n/a nM
Citation
 Ilies, MDi Costanzo, LNorth, MLScott, JAChristianson, DW 2-aminoimidazole amino acids as inhibitors of the binuclear manganese metalloenzyme human arginase I. J Med Chem 53:4266-76 (2010)  
Target
Name:
Nitric oxide synthase, brain
Synonyms:
Bnos NC-NOS NOS type I nNOS Neuronal nitric oxide synthase Nitric Oxide Synthase, brain Nitric oxide synthase, brain (nNOS) Nitric-oxide synthase, brain (nNOS) Nos1 | Peptidyl-cysteine S-nitrosylase NOS1
Type:
Enzyme
Mol. Mass.:
160570.98
Organism:
Rattus norvegicus (rat)
Description:
Recombinant nNOS overexpressed in E. coli was used in enzyme assays.
Residue:
1429
  
Inhibitor
Name:
BDBM50316606
Synonyms:
(2S)-2-amino-4-(2-amino-1H-imidazol-5-yl)butanoic acid CHEMBL1099168
Type:
Small organic molecule
Emp. Form.:
C7H12N4O2
Mol. Mass.:
184.1958
SMILES:
N[C@@H](CCc1cnc(N)[nH]1)C(O)=O
: