Target
D(2) dopamine receptor
Ligand
BDBM50316967
Substrate
Meas. Tech.
ChEMBL_630120 (CHEMBL1113711)
Ki
>10000±n/a nM
Citation
 Fiorino, FSeverino, BDe Angelis, FPerissutti, EMagli, EFrecentese, FEsposito, AMassarelli, PNencini, CSantagada, VCaliendo, G New 5-HT(1A) receptor ligands containing a N'-cyanoisonicotinamidine nucleus: synthesis and in vitro pharmacological evaluation. Bioorg Med Chem Lett 20:2978-82 (2010)  
Target
Name:
D(2) dopamine receptor
Synonyms:
DOPAMINE D2 DOPAMINE D2 Short Dopamine D2 receptor Drd2
Type:
G Protein-Coupled Receptor (GPCR)
Mol. Mass.:
50931.60
Organism:
Rattus norvegicus (rat)
Description:
P61169
Residue:
444
  
Inhibitor
Name:
BDBM50316967
Synonyms:
CHEMBL1086958 | N-(3-(4-(3-chlorophenyl)piperazin-1-yl)propyl)-N'-cyanoisonicotinamidine
Type:
Small organic molecule
Emp. Form.:
C20H23ClN6
Mol. Mass.:
382.89
SMILES:
Clc1cccc(c1)N1CCN(CCCN=C(NC#N)c2ccncc2)CC1
: