Target
Serine/threonine-protein kinase PLK3
Ligand
BDBM50318061
Substrate
Meas. Tech.
ChEMBL_631391 (CHEMBL1109143)
IC50
11±n/a nM
Citation
 Beria, IBallinari, DBertrand, JABorghi, DBossi, RTBrasca, MGCappella, PCaruso, MCeccarelli, WCiavolella, ACristiani, CCroci, VDe Ponti, AFachin, GFerguson, RDLansen, JMoll, JKPesenti, EPosteri, HPerego, RRocchetti, MStorici, PVolpi, DValsasina, B Identification of 4,5-dihydro-1H-pyrazolo[4,3-h]quinazoline derivatives as a new class of orally and selective Polo-like kinase 1 inhibitors. J Med Chem 53:3532-51 (2010)  
Target
Name:
Serine/threonine-protein kinase PLK3
Synonyms:
CNK FGF-inducible kinase PLK3 PRK Proliferation-related kinase | Serine/threonine-protein kinase PLK3
Type:
Serine/threonine-protein kinase
Mol. Mass.:
71655.17
Organism:
Homo sapiens (Human)
Description:
Enzyme assays were using PLK3 purified from baculovirus-infected Trichoplusia ni cells expressing full-length PLK3.
Residue:
646
  
Inhibitor
Name:
BDBM50318061
Synonyms:
1-Methyl-8-{[2-(methylamino)phenyl]amino}-4,5-dihydro-1Hpyrazolo[4,3-h]quinazoline-3-carboxamide | CHEMBL1095457
Type:
Small organic molecule
Emp. Form.:
C18H19N7O
Mol. Mass.:
349.3898
SMILES:
CNc1ccccc1Nc1ncc2CCc3c(nn(C)c3-c2n1)C(N)=O
: