Target
Acetylcholinesterase
Ligand
BDBM9050
Substrate
Meas. Tech.
ChEMBL_633769 (CHEMBL1119333)
IC50
0.9±n/a nM
Citation
 Lv, WXue, Y Prediction of acetylcholinesterase inhibitors and characterization of correlative molecular descriptors by machine learning methods. Eur J Med Chem 45:1167-72 (2010)  
Target
Name:
Acetylcholinesterase
Synonyms:
ACES_HUMAN Acetylcholinesterase (AChE) | Acetylcholinesterase (human AChE)
Type:
Enzyme
Mol. Mass.:
67792.70
Organism:
Homo sapiens (Human)
Description:
P22303
Residue:
614
  
Inhibitor
Name:
BDBM9050
Synonyms:
6-fluoro-N-{6-[(6-fluoro-1,2,3,4-tetrahydroacridin-9-yl)amino]hexyl}-1,2,3,4-tetrahydroacridin-9-amine Homodimeric Tacrine Analog 3d
Type:
Small organic molecule
Emp. Form.:
C32H36F2N4
Mol. Mass.:
514.6518
SMILES:
Fc1ccc2c(NCCCCCCNc3c4CCCCc4nc4cc(F)ccc34)c3CCCCc3nc2c1
: