Target
Acetylcholinesterase
Ligand
BDBM9054
Substrate
Meas. Tech.
ChEMBL_633769 (CHEMBL1119333)
IC50
0.07±n/a nM
Citation
 Lv, WXue, Y Prediction of acetylcholinesterase inhibitors and characterization of correlative molecular descriptors by machine learning methods. Eur J Med Chem 45:1167-72 (2010)  
Target
Name:
Acetylcholinesterase
Synonyms:
ACES_HUMAN Acetylcholinesterase (AChE) | Acetylcholinesterase (human AChE)
Type:
Enzyme
Mol. Mass.:
67792.70
Organism:
Homo sapiens (Human)
Description:
P22303
Residue:
614
  
Inhibitor
Name:
BDBM9054
Synonyms:
6-chloro-N-{7-[(6-chloro-1,2,3,4-tetrahydroacridin-9-yl)amino]heptyl}-1,2,3,4-tetrahydroacridin-9-amine Homodimeric Tacrine Analog 3h
Type:
Small organic molecule
Emp. Form.:
C33H38Cl2N4
Mol. Mass.:
561.588
SMILES:
Clc1ccc2c(NCCCCCCCNc3c4CCCCc4nc4cc(Cl)ccc34)c3CCCCc3nc2c1
: