Target
Acetylcholinesterase
Ligand
BDBM50004021
Substrate
Meas. Tech.
ChEMBL_633769 (CHEMBL1119333)
IC50
660±n/a nM
Citation
 Lv, WXue, Y Prediction of acetylcholinesterase inhibitors and characterization of correlative molecular descriptors by machine learning methods. Eur J Med Chem 45:1167-72 (2010)  
Target
Name:
Acetylcholinesterase
Synonyms:
ACES_HUMAN Acetylcholinesterase (AChE) | Acetylcholinesterase (human AChE)
Type:
Enzyme
Mol. Mass.:
67792.70
Organism:
Homo sapiens (Human)
Description:
P22303
Residue:
614
  
Inhibitor
Name:
BDBM50004021
Synonyms:
CHEMBL125578 N-[2-(1-Benzyl-piperidin-4-yl)-ethyl]-N-methyl-acetamide
Type:
Small organic molecule
Emp. Form.:
C17H26N2O
Mol. Mass.:
274.4011
SMILES:
CN(CCC1CCN(Cc2ccccc2)CC1)C(C)=O
: