Target
Prostaglandin E2 receptor EP3 subtype
Ligand
BDBM50318871
Substrate
Meas. Tech.
ChEMBL_633615 (CHEMBL1117758)
Ki
56±n/a nM
Citation
 Allen, JGFotsch, CBabij, P Emerging targets in osteoporosis disease modification. J Med Chem 53:4332-53 (2010)  
Target
Name:
Prostaglandin E2 receptor EP3 subtype
Synonyms:
PE2R3_MOUSE Prostaglandin E2 receptor EP3 isoform alpha Prostanoid EP3 receptor Ptgerep3
Type:
G-protein coupled receptor
Mol. Mass.:
40092.50
Organism:
Mus musculus (Mouse)
Description:
Residue:
365
  
Inhibitor
Name:
BDBM50318871
Synonyms:
4-(2-{(1R,2R,3R)-3-Hydroxy-2-[(E)-(S)-3-hydroxy-4-(3-methoxymethyl-phenyl)-but-1-enyl]-5-oxo-cyclopentyl}-ethylsulfanyl)-butyric acid methyl ester methyl 4-(2-((1R,2R,3R)-3-hydroxy-2-((S,E)-3-hydroxy-4-(3-(methoxymethyl)phenyl)but-1-enyl)-5-oxocyclopentyl)ethylthio)butanoate
Type:
Small organic molecule
Emp. Form.:
C24H34O6S
Mol. Mass.:
450.588
SMILES:
COCc1cccc(C[C@H](O)\C=C\[C@H]2[C@H](O)CC(=O)[C@@H]2CCSCCCC(=O)OC)c1
: